{"text_format":"1","workbook":"xlsx","n_sheets":8,"sheets":["Inicio","Ejercicio","Calcular","INPC","Recargos","Efectua_Calculo","Memoria de Calculo","Mem Calc"],"not_rendered":{"charts":0,"images":2,"macros":1,"external_links":0,"defined_names":23,"comments":0,"pivot_tables":0},"unopened":[],"bounds":{"document_bytes":16777216,"sheet_cells":100000,"rows_first":2000,"rows_last":500,"rows_between":2000,"halvings":0,"cell_chars":16384,"cell_head_chars":4096},"cells_cut":0,"cells_raw":0,"read":"whole","date_system":"1900"}

{"sheet":"Inicio","index":0,"n_rows":22,"n_cols":3,"rows_kept":22,"cut":false,"hidden":false,"merged":[[19,2,19,3],[21,2,21,3],[7,2,7,5]]}
[]
[]
[]
[]
[]
[]
[]
[null,null,"Periodo 1998-2014"]
[]
[]
[]
[]
[]
[]
[]
[]
[]
[]
[]
[null,null,"Captura de Recargos"]
{"$rows_left_out":3}
{"sheet":"Ejercicio","index":1,"n_rows":28,"n_cols":10,"rows_kept":28,"cut":false,"hidden":false,"merged":[[0,0,0,2],[0,4,0,6],[2,0,2,5],[2,6,2,9],[16,0,16,1],[4,6,4,9],[5,6,5,9],[7,7,7,9],[9,7,9,9],[8,0,8,1],[15,7,15,9],[14,7,14,9],[11,0,11,1]]}
["Protasio Guerra y Asociados, S.C.",null,null,null,"pgasc@pgasc.com"]
[]
["IMPUESTOS DEL EJERCICIO FISCAL",null,null,null,null,null,"Actualizado a"]
[]
["Empresa:","*","-",null,null,null,{"$f":"INPC!AC56","v":"INPC: Diciembre de 2013"}]
["Por el ejercicio de:              ","*","-",null,null,null,{"$f":"Recargos!J223","v":"RECARGOS: Diciembre de 2014"}]
[]
[null,null,null,"Actuali-",null,null,null,"De 1998 a 2014"]
["CALCULOS",null,"Impuestos","cación","Recargos","Total"]
[null,null,null,{"$f":"Efectua_Calculo!J29","v":1.0355000000000001},{"$f":"Recargos!AA208/100","v":0.12429999999999997},null,null,"Se debió de efectuar el pago"]
[]
["Impuestos del Ejercicio",null,null,null,null,null,null,"Mes",2,"*"]
["Impuesto sobre la renta","*",0,{"$f":"+ROUND((C13*$D$10)-C13,0)","v":0},{"$f":"IF($E$10=\"error\",0,ROUND((C13+D13)*$E$10,0))","v":0},{"$f":"SUM(C13:E13)","v":0},null,"Año",2013,"*"]
["Ietu/Impac","*",0,{"$f":"+ROUND((C14*$D$10)-C14,0)","v":0},{"$f":"IF($E$10=\"error\",0,ROUND((C14+D14)*$E$10,0))","v":0},{"$f":"SUM(C14:E14)","v":0}]
["-","*",0,{"$f":"+ROUND((C15*$D$10)-C15,0)","v":0},{"$f":"IF($E$10=\"error\",0,ROUND((C15+D15)*$E$10,0))","v":0},{"$f":"SUM(C15:E15)","v":0},null,"Se realizará el pago"]
[]
["Otros Calculos Anuales",null,null,null,null,null,null,"Dia",19]
["ISR sueldos","*",0,{"$f":"+ROUND((C18*$D$10)-C18,0)","v":0},{"$f":"IF($E$10=\"error\",0,ROUND((C18+D18)*$E$10,0))","v":0},{"$f":"SUM(C18:E18)","v":0},null,{"$f":"+H12","v":"Mes"},1,"*"]
["-","*",0,0,0,0,null,{"$f":"+H13","v":"Año"},2014,"*"]
["-","*",0,0,0,0]
{"$rows_left_out":9}
{"sheet":"Calcular","index":2,"n_rows":34,"n_cols":10,"rows_kept":34,"cut":false,"hidden":false,"merged":[[24,0,24,1],[8,0,8,1],[14,7,14,9],[11,0,11,1],[2,6,2,9],[16,0,16,1],[0,0,0,2],[0,4,0,6],[7,7,7,9],[9,7,9,9],[2,0,2,5],[4,6,4,9],[5,6,5,9]]}
["Protasio Guerra y Asociados, S.C.",null,null,null,"pgasc@pgasc.com"]
[]
["IMPUESTOS PROVISIONALES, DEFINITIVOS Y ENTERO DE RETENCIONES MENSALES",null,null,null,null,null,"Actualizado a"]
[]
["Empresa:","*","-",null,null,null,{"$f":"INPC!AC56","v":"INPC: Diciembre de 2013"}]
["Período:                      ","*","-",null,null,null,{"$f":"Recargos!J223","v":"RECARGOS: Diciembre de 2014"}]
[]
[null,null,null,"Actuali-",null,null,null,"De 1998 a 2014"]
["CALCULOS",null,"Impuestos","cación","Recargos","Total"]
[null,null,null,{"$f":"Efectua_Calculo!J14","v":1.0169999999999999},{"$f":"Recargos!I221/100","v":4.5199999999999997E-2},null,null,"Se debió de efectuar el pago"]
[]
["Pagos Prov. o Definitivos",null,null,null,null,null,null,"Mes",1,"*"]
["Impuesto sobre la renta","*",0,{"$f":"+ROUND((C13*$D$10)-C13,0)","v":0},{"$f":"IF($E$10=\"error\",0,ROUND((C13+D13)*$E$10,0))","v":0},{"$f":"SUM(C13:E13)","v":0},null,"Año",2013,"*"]
["Impac/Ietu","*",0,{"$f":"+ROUND((C14*$D$10)-C14,0)","v":0},{"$f":"IF($E$10=\"error\",0,ROUND((C14+D14)*$E$10,0))","v":0},{"$f":"SUM(C14:E14)","v":0}]
["Impuesto al valor agregado","*",0,{"$f":"+ROUND((C15*$D$10)-C15,0)","v":0},0,{"$f":"SUM(C15:E15)","v":0},null,"Se realizará el pago"]
[]
["Retenciones",null,null,null,null,null,null,"Día",15,"*"]
["ISR sueldos","*",0,{"$f":"+ROUND((C18*$D$10)-C18,0)","v":0},0,{"$f":"SUM(C18:E18)","v":0},null,{"$f":"+H12","v":"Mes"},5,"*"]
["ISR asimilables","*",0,0,0,0,null,{"$f":"+H13","v":"Año"},2013,"*"]
["ISR honorarios","*",0,0,0,0]
{"$rows_left_out":15}
{"sheet":"INPC","index":3,"n_rows":56,"n_cols":30,"rows_kept":56,"cut":false,"hidden":false,"merged":[[1,0,1,2],[1,3,1,5]]}
[" "]
["Indice Nacional del Precios al Consumidor",null,null,"INPC Base = 2a Quincena Diciembre de 2010",null,null,"Regresar al Menú de Cálculo"]
[]
["Año","Enero","Febrero","Marzo","Abril","Mayo","Junio","Julio","Agosto","Septiembre","Octubre","Noviembre","Diciembre",null,null,"Enero","Febrero","Marzo","Abril","Mayo","Junio","Julio","Agosto","Septiembre","Octubre","Noviembre","Diciembre"]
[]
[1969,1.5434126596E-2,1.5489521629000001E-2,1.5504809914E-2,1.5546833732E-2,1.5546833732E-2,1.5602235662000001E-2,1.5661457938000001E-2,1.5678656395999999E-2,1.5825753553000001E-2,1.5991959342000001E-2,1.5993869514999998E-2,1.6114224242E-2]
[1970,1.6236489141999998E-2,1.6234578969000001E-2,1.6282340204E-2,1.6303352112999998E-2,1.6337742132999999E-2,1.6437084950999999E-2,1.6517319137000001E-2,1.6593732975999999E-2,1.6633853516999999E-2,1.6639584036999999E-2,1.6729375987E-2,1.6870742623E-2]
[1971,1.7036948412E-2,1.710763173E-2,1.7172584527E-2,1.7260466302999999E-2,1.7296766496999998E-2,1.7375090509000001E-2,1.7361719293999999E-2,1.7520277492000001E-2,1.7577589594999998E-2,1.7594788053E-2,1.7623440657E-2,1.7707502085999999E-2]
[1972,1.7785826098000002E-2,1.7841228027999999E-2,1.7938660671999999E-2,1.8051374703999999E-2,1.8087668001999999E-2,1.8221393943999999E-2,1.8290173983999999E-2,1.8410528711000001E-2,1.8494583243999999E-2,1.8507954459000001E-2,1.8628309185999999E-2,1.8691358706E-2]
[1973,1.8962630937E-2,1.9119285856999998E-2,1.9287401818999999E-2,1.9593064069999999E-2,1.9801300572999999E-2,1.9963679118E-2,2.0475667699E-2,2.0804258929000001E-2,2.1299049051E-2,2.1572238351E-2,2.1837786957000001E-2,2.2686000564999999E-2]
[1974,2.3497920876E-2,2.4029011191999999E-2,2.4214325612000001E-2,2.4542909945999999E-2,2.4735865060000001E-2,2.4980394861E-2,2.5341459042000001E-2,2.5608917820999999E-2,2.5899298684E-2,2.6413190542E-2,2.7146786839999999E-2,2.7358843689999999E-2]
[1975,2.7708446828999998E-2,2.7861274506000001E-2,2.8037031162999999E-2,2.8273920269E-2,2.8652182908E-2,2.9139332335999999E-2,2.9372401095E-2,2.9626488659999999E-2,2.9842358961000001E-2,2.9995193534E-2,3.0205340210999999E-2,3.0451780184999999E-2]
[1976,3.1040182603999999E-2,3.1620944328999999E-2,3.1930426927000002E-2,3.2153944818999997E-2,3.2379372884000002E-2,3.2509278478000003E-2,3.2784377952000003E-2,3.3097680897999998E-2,3.4226731396E-2,3.6154324095000002E-2,3.7787715584000001E-2,3.8735272010000002E-2]
[1977,3.9969395847000003E-2,4.0851999476000003E-2,4.1564576968999997E-2,4.2193099929E-2,4.2563714976999997E-2,4.3085254424999997E-2,4.3572410749E-2,4.4466475419E-2,4.5255473647E-2,4.5601256439000003E-2,4.6099866907999998E-2,4.6737940736000003E-2]
[1978,4.7777199286000001E-2,4.8463034348999998E-2,4.8967375339000002E-2,4.9511843765999999E-2,4.9997083019999999E-2,5.0684828256999999E-2,5.1544509803000002E-2,5.2058408556000003E-2,5.2652541496000002E-2,5.3290615324E-2,5.3838897201999997E-2,5.4295483853000003E-2]
[1979,5.6223076551999998E-2,5.7031176514999997E-2,5.7804886457999999E-2,5.8322605559999997E-2,5.9086771530999997E-2,5.9742036920999997E-2,6.0466075454999997E-2,6.1381158930999997E-2,6.2133856964999998E-2,6.3218966574999994E-2,6.4032797059999993E-2,6.5165661010000001E-2]
[1980,6.8342658934000003E-2,6.9922558667000007E-2,7.1361091764000004E-2,7.2608579919999999E-2,7.3793032349000004E-2,7.5256397702000002E-2,7.7357836883999997E-2,7.8960658700000005E-2,7.9837538703000005E-2,8.1046816492000004E-2,8.2452876639E-2,8.4615448270000004E-2]
[1981,8.7341590063999996E-2,8.9486970134000005E-2,9.1401184721000006E-2,9.3462510257999995E-2,9.4876204202000006E-2,9.6202023267000003E-2,9.7896547205999995E-2,9.9913931853999993E-2,0.101772751408,0.10403084551,0.106032941874,0.108887079089]
[1982,0.114297331963,0.118788687911,0.123127202389,0.12980023170300001,0.13709605345699999,0.14370030273100001,0.151105018171,0.16806172550000001,0.17703296945800001,0.18621053284899999,0.19562498534600001,0.21651520898099999]
[1983,0.240074262308,0.25295800376499999,0.26520176122099998,0.28199226276299999,0.29422264900400003,0.30536410528699998,0.32046199306299999,0.33290060891099998,0.34314609035100002,0.35453206953900002,0.37535352692500001,0.391412349238]
{"$rows_left_out":37}
{"sheet":"Recargos","index":4,"n_rows":223,"n_cols":27,"rows_kept":223,"cut":false,"hidden":false,"merged":[]}
["Año","Mes","Mes",null,"Recargos",null,null,null,"Para PP",null,null,{"$f":"Calcular!I12","v":1},{"$f":"Calcular!I13","v":2013},{"$f":"CONCATENATE(TEXT(M1,0),RIGHT(\"00\"&TEXT(L1,0),2))","v":"201301"},null,null,null,null,null,null,null,null,{"$f":"Ejercicio!I12","v":2},{"$f":"Ejercicio!I13","v":2013},{"$f":"CONCATENATE(TEXT(X1,0),RIGHT(\"00\"&TEXT(W1+1,0),2))","v":"201303"}]
[null,null,null,null,null,null,null,null,0,null,{"$f":"Calcular!I17","v":15},{"$f":"Calcular!I18","v":5},{"$f":"Calcular!I19","v":2013},{"$f":"IF(K2>17,CONCATENATE(TEXT(M2,0),RIGHT(\"00\"&TEXT(L2,0),2)),IF(L2=1,CONCATENATE(TEXT(M2-1,0),TEXT(12,0)),CONCATENATE(TEXT(M2,0),RIGHT(\"00\"&TEXT(L2-1,0),2))))","v":"201304"},null,null,null,null,null,null,null,null,{"$f":"Ejercicio!I18","v":1},{"$f":"Ejercicio!I19","v":2014},{"$f":"CONCATENATE(TEXT(X2,0),RIGHT(\"00\"&TEXT(W2,0),2))","v":"201401"},null,0]
[1998,1,{"$f":"VLOOKUP(B3,Meses,2)","v":"Enero"},{"$f":"+CONCATENATE(TEXT(A3,0),RIGHT(\"00\"&TEXT(B3,0),2))","v":"199801"},2.48,null,null,3,{"$f":"IF($N$2<$N$1,0,IF(I2=0,IF(D3=$N$1,E3,0),IF(D3>$N$2,0,E3)))","v":0},null,null,null,null,null,null,null,null,{"$f":"H3","v":3},{"$f":"D3","v":"199801"},{"$f":"E3","v":2.48},null,null,null,null,null,null,{"$f":"IF(AA2=0,IF(D3=$Y$1,E3,0),IF(D3>$Y$2,0,E3))","v":0}]
[1998,2,"Febrero",{"$f":"+CONCATENATE(TEXT(A4,0),RIGHT(\"00\"&TEXT(B4,0),2))","v":"199802"},1.74,null,null,{"$f":"H3+1","v":4},0,null,null,null,null,null,null,null,null,{"$f":"H4","v":4},{"$f":"D4","v":"199802"},{"$f":"E4","v":1.74},null,null,null,null,null,null,{"$f":"IF(AA3=0,IF(D4=$Y$1,E4,0),IF(D4>$Y$2,0,E4))","v":0}]
[1998,3,"Marzo","199803",0.44,null,null,{"$f":"H4+1","v":5},0,null,null,null,null,null,null,null,null,5,"199803",0.44,null,null,null,null,null,null,0]
[1998,4,"Abril","199804",1.22,null,null,6,0,null,null,null,null,null,null,null,null,6,"199804",1.22,null,null,null,null,null,null,0]
[1998,5,"Mayo","199805",2.31,null,null,7,0,null,null,null,null,null,1,"Enero",null,7,"199805",2.31,null,null,null,null,null,null,0]
[1998,6,"Junio","199806",2.4500000000000002,null,null,8,0,null,null,null,null,null,2,"Febrero",null,8,"199806",2.4500000000000002,null,null,null,null,null,null,0]
[1998,7,"Julio","199807",2.54,null,null,9,0,null,null,null,null,null,3,"Marzo",null,9,"199807",2.54,null,null,null,null,null,null,0]
[1998,8,"Agosto","199808",2.25,null,null,10,0,null,null,null,null,null,4,"Abril",null,10,"199808",2.25,null,null,null,null,null,null,0]
[1998,9,"Septiembre","199809",2.66,null,null,11,0,null,null,null,null,null,5,"Mayo",null,11,"199809",2.66,null,null,null,null,null,null,0]
[1998,10,"Octubre","199810",3,null,null,12,0,null,null,null,null,null,6,"Junio",null,12,"199810",3,null,null,null,null,null,null,0]
[1998,11,"Noviembre","199811",3,null,null,13,0,null,null,null,null,null,7,"Julio",null,13,"199811",3,null,null,null,null,null,null,0]
[1998,12,"Diciembre","199812",3,null,null,14,0,null,null,null,null,null,8,"Agosto",null,14,"199812",3,null,null,null,null,null,null,0]
[1999,1,"Enero","199901",3,null,null,15,0,null,null,null,null,null,9,"Septiembre",null,15,"199901",3,null,null,null,null,null,null,0]
[1999,2,"Febrero","199902",3,null,null,16,0,null,null,null,null,null,10,"Octubre",null,16,"199902",3,null,null,null,null,null,null,0]
[1999,3,"Marzo","199903",2.92,null,null,17,0,null,null,null,null,null,11,"Noviembre",null,17,"199903",2.92,null,null,null,null,null,null,0]
[1999,4,"Abril","199904",3,null,null,18,0,null,null,null,null,null,12,"Diciembre",null,18,"199904",3,null,null,null,null,null,null,0]
[1999,5,"Mayo","199905",3,null,null,19,0,null,null,null,null,null,null,null,null,19,"199905",3,null,null,null,null,null,null,0]
[1999,6,"Junio","199906",2.85,null,null,20,0,null,null,null,null,null,null,null,null,20,"199906",2.85,null,null,null,null,null,null,0]
{"$rows_left_out":204}
{"sheet":"Efectua_Calculo","index":5,"n_rows":36,"n_cols":14,"rows_kept":36,"cut":false,"hidden":false,"merged":[[2,1,2,3],[17,1,17,4],[0,1,0,3]]}
[null,"ACTUALIZACIÓN"]
[]
[null,"PAGOS Y ENTEROS PROVISIONALES"]
[]
[null,"Se debió de haber pagado en el mes",null,null,{"$f":"Calcular!I12","v":1},null,"INPC mas antiguo",null,null,{"$f":"VLOOKUP(I6,INPC,I7+1)","v":107.246},null,null,{"$f":"CONCATENATE(\"17/\",RIGHT(\"00\"&TEXT(E5,0),2),\"/\",TEXT(E6,0))","v":"17/01/2013"},{"$f":"DATEVALUE(M5)","v":41291}]
[null,"Del año",null,null,{"$f":"Calcular!I13","v":2013},null,"Año base",null,{"$f":"IF(E5=1,E6-1,E6)","v":2012},null,null,null,{"$f":"CONCATENATE(RIGHT(\"00\"&TEXT(E8,0),2),\"/\",RIGHT(\"00\"&TEXT(E9,0),2),\"/\",TEXT(E10,0))","v":"15/05/2013"},{"$f":"DATEVALUE(M6)","v":41409}]
[null,null,null,null,null,null,"Mes base",null,{"$f":"IF(E5=1,12,E5-1)","v":12}]
[null,"Se pagara el día",null,null,{"$f":"Calcular!I17","v":15},null,null,null,null,null,null,null,null,{"$f":"N6-N5","v":118}]
[null,"Del mes",null,null,{"$f":"Calcular!I18","v":5},null,"INPC mas reciente",null,null,{"$f":"IF(N8<32,J5,VLOOKUP(I10,INPC,I11+1))","v":109.074}]
[null,"Del año",null,null,{"$f":"Calcular!I19","v":2013},null,"Año Base",null,{"$f":"IF(N8<32,I6,IF(E8>9,IF(E9=1,E10-1,E10),IF(E9<3,E10-1,E10)))","v":2013}]
[null,null,null,null,null,null,"Mes Base:",null,{"$f":"IF(N8<32,I7,IF(E8>9,IF(E9=1,12,E9-1),IF(E9=1,11,IF(E9=2,12,E9-2))))","v":4}]
[]
[]
[null,null,null,null,null,null,"Factor de actualización",null,null,{"$f":"IF(J5>J9,1,ROUND(INT(ABS((J9/J5)*10000))/10000,4))","v":1.0169999999999999}]
[]
[]
[]
[null,"PAGOS EN DECLARACIONES ANUALES"]
[]
[null,"Se debió de haber pagado en el mes",null,null,{"$f":"Ejercicio!I12","v":2},null,"INPC mas antiguo",null,null,{"$f":"VLOOKUP(I21,INPC,I22+1)","v":107.678}]
{"$rows_left_out":17}
{"sheet":"Memoria de Calculo","index":6,"n_rows":153,"n_cols":19,"rows_kept":153,"cut":false,"hidden":false,"merged":[[3,1,3,7],[13,1,13,7],[0,0,0,7]]}
["IMPUESTOS PROVISIONALES, DEFINITIVOS Y ENTERO DE RETENCIONES MENSALES",null,null,null,null,null,null,null,null,2013]
[null,null,null,null,null,null,"Regresa al menú Anterior"]
[]
[null,"CALCULO DEL FACTOR DE ACTUALIZACION"]
[]
[]
[null,null,null,null,null,null,"INPC",null,"Factor"]
[]
[null,"Mes mas reciente:",null,{"$f":"VLOOKUP(Efectua_Calculo!I11,Meses,2)","v":"Abril"},{"$f":"Efectua_Calculo!I10","v":2013},null,{"$f":"VLOOKUP(Efectua_Calculo!I10,INPC,Efectua_Calculo!I11+1)","v":109.074},null,{"$f":"Efectua_Calculo!J14","v":1.0169999999999999}]
[null,"Mes mas antiguo:",null,{"$f":"VLOOKUP(Efectua_Calculo!I7,Meses,2)","v":"Diciembre"},{"$f":"Efectua_Calculo!I6","v":2012},null,{"$f":"VLOOKUP(Efectua_Calculo!I6,INPC,Efectua_Calculo!I7+1)","v":107.246}]
[]
["       (No se actualizan los importes por períodos menores a un mes (Art 17-A 1er. párrafo CFF)"]
[]
[null,"SUMA DE RECARGOS"]
[]
[null,null,null,null,null,null,null,null,null,null,null,null,{"$f":"Recargos!N1","v":"201301"},{"$f":"Recargos!N2","v":"201304"},null,{"$f":"IF(N16<M16,0,VLOOKUP(M16,Recargos,5))","v":183},{"$f":"IF(P16=0,0,VLOOKUP(P16,Rec,2))","v":"201301"},{"$f":"IF(Q16=0,\"-\",VLOOKUP(VALUE(RIGHT(Q16,2)),Meses,2)&\" de \"&LEFT(Q16,4))","v":"Enero de 2013"},{"$f":"IF(P16=0,0,VLOOKUP(P16,Rec,3))","v":1.1299999999999999}]
[null,{"$f":"R16","v":"Enero de 2013"},null,{"$f":"S16","v":1.1299999999999999},null,null,"Total de Recargos",null,{"$f":"SUM(D17:D153)/100","v":4.5199999999999997E-2},null,null,null,null,null,null,{"$f":"IF(P16=0,0,IF((P16+1)>$N$21,0,P16+1))","v":184},{"$f":"IF(P17=0,0,VLOOKUP(P17,Rec,2))","v":"201302"},{"$f":"IF(Q17=0,\"-\",VLOOKUP(VALUE(RIGHT(Q17,2)),Meses,2)&\" de \"&LEFT(Q17,4))","v":"Febrero de 2013"},1.1299999999999999]
[null,{"$f":"R17","v":"Febrero de 2013"},null,{"$f":"S17","v":1.1299999999999999},null,null,null,null,null,null,null,null,{"$f":"RIGHT(M16,2)","v":"01"},{"$f":"RIGHT(N16,2)","v":"04"},null,{"$f":"IF(P17=0,0,IF((P17+1)>$N$21,0,P17+1))","v":185},{"$f":"IF(P18=0,\"-\",VLOOKUP(P18,Rec,2))","v":"201303"},{"$f":"IF(Q18=\"-\",\"-\",VLOOKUP(VALUE(RIGHT(Q18,2)),Meses,2)&\" de \"&LEFT(Q18,4))","v":"Marzo de 2013"},1.1299999999999999]
[null,"Marzo de 2013",null,1.1299999999999999,null,null,null,null,null,null,null,null,{"$f":"LEFT(M16,4)","v":"2013"},{"$f":"LEFT(N16,4)","v":"2013"},null,186,"201304","Abril de 2013",1.1299999999999999]
[null,"Abril de 2013",null,1.1299999999999999,null,null,null,null,null,null,null,null,null,null,null,0,"-","-",0]
{"$rows_left_out":134}
{"sheet":"Mem Calc","index":7,"n_rows":153,"n_cols":19,"rows_kept":153,"cut":false,"hidden":false,"merged":[[3,1,3,7],[13,1,13,7],[0,0,0,5]]}
["IMPUESTOS DEL EJERCICIO FISCAL"]
[null,null,null,null,null,null,"Regresa al menú Anterior"]
[]
[null,"CALCULO DEL FACTOR DE ACTUALIZACION"]
[]
[]
[null,null,null,null,null,null,"INPC",null,"Factor"]
[]
[null,"Mes mas reciente:",null,{"$f":"VLOOKUP(Efectua_Calculo!I26,Meses,2)","v":"Diciembre"},{"$f":"Efectua_Calculo!I25","v":2013},null,{"$f":"VLOOKUP(Efectua_Calculo!I25,INPC,Efectua_Calculo!I26+1)","v":111.508},null,{"$f":"Efectua_Calculo!J29","v":1.0355000000000001}]
[null,"Mes mas antiguo:",null,{"$f":"VLOOKUP(Efectua_Calculo!I22,Meses,2)","v":"Enero"},{"$f":"Efectua_Calculo!I21","v":2013},null,{"$f":"VLOOKUP(Efectua_Calculo!I21,INPC,Efectua_Calculo!I22+1)","v":107.678}]
[]
["       (No se actualizan los importes por períodos menores a un mes (Art 17-A 1er. párrafo CFF)"]
[]
[null,"SUMA DE RECARGOS"]
[]
[null,null,null,null,null,null,null,null,null,null,null,null,{"$f":"Recargos!Y1","v":"201303"},{"$f":"Recargos!Y2","v":"201401"},null,{"$f":"VLOOKUP(M16,Recargos,5)","v":185},{"$f":"IF(P16=0,0,VLOOKUP(P16,Rec,2))","v":"201303"},{"$f":"IF(Q16=0,0,VLOOKUP(VALUE(RIGHT(Q16,2)),Meses,2)&\" de \"&LEFT(Q16,4))","v":"Marzo de 2013"},{"$f":"VLOOKUP(P16,Rec,3)","v":1.1299999999999999}]
[null,{"$f":"R16","v":"Marzo de 2013"},null,{"$f":"S16","v":1.1299999999999999},null,null,"Total de Recargos",null,{"$f":"SUM(D17:D153)/100","v":0.12429999999999997},null,null,null,null,null,null,{"$f":"IF((P16+1)>$N$21,0,P16+1)","v":186},{"$f":"IF(P17=0,\"-\",VLOOKUP(P17,Rec,2))","v":"201304"},{"$f":"IF(Q17=\"-\",\"-\",VLOOKUP(VALUE(RIGHT(Q17,2)),Meses,2)&\" de \"&LEFT(Q17,4))","v":"Abril de 2013"},{"$f":"IF(R17=\"-\",\"-\",VLOOKUP(P17,Rec,3))","v":1.1299999999999999}]
[null,{"$f":"R17","v":"Abril de 2013"},null,{"$f":"S17","v":1.1299999999999999},null,null,null,null,null,null,null,null,{"$f":"RIGHT(M16,2)","v":"03"},{"$f":"RIGHT(N16,2)","v":"01"},null,{"$f":"IF(P17=0,0,IF((P17+1)>$N$21,0,P17+1))","v":187},{"$f":"IF(P18=0,\"-\",VLOOKUP(P18,Rec,2))","v":"201305"},{"$f":"IF(Q18=\"-\",\"-\",VLOOKUP(VALUE(RIGHT(Q18,2)),Meses,2)&\" de \"&LEFT(Q18,4))","v":"Mayo de 2013"},1.1299999999999999]
[null,"Mayo de 2013",null,1.1299999999999999,null,null,null,null,null,null,null,null,{"$f":"LEFT(M16,4)","v":"2013"},{"$f":"LEFT(N16,4)","v":"2014"},null,{"$f":"IF(P18=0,0,IF((P18+1)>$N$21,0,P18+1))","v":188},"201306","Junio de 2013",1.1299999999999999]
[null,"Junio de 2013",null,1.1299999999999999,null,null,null,null,null,null,null,null,null,null,null,{"$f":"IF(P19=0,0,IF((P19+1)>$N$21,0,P19+1))","v":189},"201307","Julio de 2013",1.1299999999999999]
{"$rows_left_out":133}